[ previous ] [ next ] [ threads ]
 To :  yate@v...
 From :  "Script Head" <scripthead@g...>
 Subject :  Error in IAX compiling on FC5 64bit
 Date :  Mon, 7 Aug 2006 20:44:52 -0400
I am trying to compile latest Yate on FC5 64 bit platform and receive the
following:

[root@2 yate]# make
make -C ./engine all
make[1]: Entering directory `/usr/src/yate/engine'
make[1]: Nothing to be done for `all'.
make[1]: Leaving directory `/usr/src/yate/engine'
make -C ./modules all
make[1]: Entering directory `/usr/src/yate/modules'
make[2]: Entering directory `/usr/src/yate/modules/skin'
make[2]: Nothing to be done for `all'.
make[2]: Leaving directory `/usr/src/yate/modules/skin'
make[2]: Entering directory `/usr/src/yate/modules/help'
make[2]: Nothing to be done for `all'.
make[2]: Leaving directory `/usr/src/yate/modules/help'
make -C ../contrib/yiax
make[2]: Entering directory `/usr/src/yate/contrib/yiax'
g++ -Wall   -I../.. -I../.. -I. -O2 -fno-check-new  -fno-exceptions -fPIC
-DHAVE_GCC_FORMAT_CHECK  -c frame.cpp
./yateiax.h:1504: error: extra qualification âTelEngine::IAXTransaction::â
on member âgetEventResponse_Newâ
./yateiax.h:1511: error: extra qualification âTelEngine::IAXTransaction::â
on member âprocessAuthReqâ
./yateiax.h:1519: error: extra qualification âTelEngine::IAXTransaction::â
on member âprocessAcceptâ
./yateiax.h:1526: error: extra qualification âTelEngine::IAXTransaction::â
on member âprocessAuthRepâ
./yateiax.h:1534: error: extra qualification âTelEngine::IAXTransaction::â
on member âgetEventResponse_Regâ
./yateiax.h:1541: error: extra qualification âTelEngine::IAXTransaction::â
on member âprocessRegAckâ
./yateiax.h:1686: error: extra qualification âTelEngine::IAXTransaction::â
on member âretransmitOnVNAKâ
make[2]: *** [frame.o] Error 1
make[2]: Leaving directory `/usr/src/yate/contrib/yiax'
make[1]: *** [../contrib/yiax/libyateiax.a] Error 2
make[1]: Leaving directory `/usr/src/yate/modules'
make: *** [modules] Error 2

any takes on this?

ScriptHead



I am trying to compile latest Yate on FC5 64 bit platform and receive the following:

[root@2 yate]# make
make -C ./engine all
make[1]: Entering directory `/usr/src/yate/engine'
make[1]: Nothing to be done for `all'.
make[1]: Leaving directory `/usr/src/yate/engine'
make -C ./modules all
make[1]: Entering directory `/usr/src/yate/modules'
make[2]: Entering directory `/usr/src/yate/modules/skin'
make[2]: Nothing to be done for `all'.
make[2]: Leaving directory `/usr/src/yate/modules/skin'
make[2]: Entering directory `/usr/src/yate/modules/help'
make[2]: Nothing to be done for `all'.
make[2]: Leaving directory `/usr/src/yate/modules/help'
make -C ../contrib/yiax
make[2]: Entering directory `/usr/src/yate/contrib/yiax'
g++ -Wall   -I../.. -I../.. -I. -O2 -fno-check-new  -fno-exceptions -fPIC -DHAVE_GCC_FORMAT_CHECK  -c frame.cpp
./yateiax.h:1504: error: extra qualification âTelEngine::IAXTransaction::â on member âgetEventResponse_Newâ
./yateiax.h:1511: error: extra qualification âTelEngine::IAXTransaction::â on member âprocessAuthReqâ
./yateiax.h:1519: error: extra qualification âTelEngine::IAXTransaction::â on member âprocessAcceptâ
./yateiax.h:1526: error: extra qualification âTelEngine::IAXTransaction::â on member âprocessAuthRepâ
./yateiax.h:1534: error: extra qualification âTelEngine::IAXTransaction::â on member âgetEventResponse_Regâ
./yateiax.h:1541: error: extra qualification âTelEngine::IAXTransaction::â on member âprocessRegAckâ
./yateiax.h:1686: error: extra qualification âTelEngine::IAXTransaction::â on member âretransmitOnVNAKâ
make[2]: *** [frame.o] Error 1
make[2]: Leaving directory `/usr/src/yate/contrib/yiax'
make[1]: *** [../contrib/yiax/libyateiax.a] Error 2
make[1]: Leaving directory `/usr/src/yate/modules'
make: *** [modules] Error 2

any takes on this?

ScriptHead