[ previous ] [ next ] [ threads ]
 To :  Javier Oviedo <joviedo@p...>
 From :  Diana Cionoiu <diana-liste@d...>
 Subject :  Re: [yate] Compiling yate
 Date :  Mon, 14 Nov 2005 19:07:52 +0200
Hello Javier,

Yate 0.8.5 is no longer used. Please try Yate 0.9.0pre4.

Diana

Javier Oviedo wrote:

>Hi!
>I'm trying to compile Yate 0.8.5 in my Linux system (I've RedHat
>Enterprises Linux 3 - Linux clu-1 2.4.21-32.EL #1 Fri Apr 15 21:29:19
>EDT 2005 i686 i686 i386 GNU/Linux) and I obtain the following error:
>g++ -Wall   -I.. -O2 -fno-exceptions -fno-check-new -fPIC 
>-DHAVE_GCC_FORMAT_CHECK  -export-dynamic -shared
>-Wl,--retain-symbols-file,/dev/null -L.. -lyate -o h323chan.yate
>-DPHAS_TEMPLATES -D_REENTRANT -DP_HAS_SEMAPHORES -I/usr/include/ptlib
>-I/usr/include/openh323 -L/usr/lib -lpt -L/usr/lib -lopenh323 h323chan.cpp
>h323chan.cpp: En member function `virtual H323GatekeeperRequest::Response
>   YateGatekeeperServer::OnRegistration(H323GatekeeperRRQ&)':
>h323chan.cpp:1070: `H323Transaction' sin declarar (primero use esta
>función)
>h323chan.cpp:1070: (Cada identificador sin declarar es reportado sólo
>una vez
>   para cada función en el que aparece.)
>h323chan.cpp:1070: error sintáctico antes del elemento `::'
>h323chan.cpp: En member function `virtual H323GatekeeperRequest::Response
>   YateGatekeeperServer::OnUnregistration(H323GatekeeperURQ&)':
>h323chan.cpp:1088: error sintáctico antes del elemento `::'
>make[1]: *** [h323chan.yate] Error 1
>make[1]: Saliendo directorio `/root/VoIP/yate/modules'
>make: *** [modules] Error 2
>
>I've installed gnukg-2.2.2 , pwlib_v1_9_1 and openh323_v1_17_2
>
>Do you Have any idea to solve it
>
>Thanks in advance
>Best Regards!!
>  
>